{"text_format":"1","workbook":"xlsx","n_sheets":10,"sheets":["Tarife","Parameter","Listen","Texte","Berechnung_einzeln","Beitragsrechner","Beitragsrechner IV","Druck","Erfassung_Bestand","Bestandesübersicht"],"not_rendered":{"charts":0,"images":3,"macros":1,"external_links":0,"defined_names":123,"comments":0,"pivot_tables":0},"unopened":[],"bounds":{"document_bytes":16777216,"sheet_cells":100000,"rows_first":2000,"rows_last":500,"rows_between":2000,"halvings":0,"cell_chars":16384,"cell_head_chars":4096},"cells_cut":0,"cells_raw":0,"read":"whole","date_system":"1900"}

{"sheet":"Tarife","index":0,"n_rows":164,"n_cols":16,"rows_kept":164,"cut":false,"hidden":true,"merged":[[0,0,0,2],[1,1,1,2],[1,3,1,4],[1,5,1,6]]}
["Tarife für das Jahr",null,null,null,null,null,2022]
[null,"Plan A",null,"Plan B",null,"Plan C"]
[null,"Männer","Frauen","Männer","Frauen","Männer","Frauen","SiFo","VK","Alter",null,null,null,"VK Rabatte","Rabatt","Vkmax"]
[{"$f":"p_jahr-18","v":2004},1.12E-2,1.01E-2,1.15E-2,1.03E-2,1.3299999999999999E-2,1.12E-2,0,8.0000000000000002E-3,{"$f":"p_jahr-A4","v":18},null,null,null,0,0,360]
[{"$f":"A4-1","v":2003},1.12E-2,1.01E-2,1.15E-2,1.03E-2,1.3299999999999999E-2,1.12E-2,0,8.0000000000000002E-3,19,null,null,null,1,1E-3,336]
[2002,1.12E-2,1.01E-2,1.15E-2,1.03E-2,1.3299999999999999E-2,1.12E-2,0,8.0000000000000002E-3,20,null,null,null,2,2E-3,312]
[2001,1.12E-2,1.01E-2,1.15E-2,1.03E-2,1.3299999999999999E-2,1.12E-2,0,8.0000000000000002E-3,21,null,null,null,3,3.0000000000000001E-3,288]
[2000,1.12E-2,1.01E-2,1.15E-2,1.03E-2,1.3299999999999999E-2,1.12E-2,0,8.0000000000000002E-3,22,null,null,null,4,4.0000000000000001E-3,264]
[1999,1.12E-2,1.01E-2,1.15E-2,1.03E-2,1.3299999999999999E-2,1.12E-2,0,8.0000000000000002E-3,23,null,null,null,5,5.0000000000000001E-3,240]
[1998,1.12E-2,1.01E-2,1.15E-2,1.03E-2,1.3299999999999999E-2,1.12E-2,0,8.0000000000000002E-3,24]
[1997,9.1509999999999994E-2,9.3710000000000002E-2,9.2509999999999995E-2,9.511E-2,9.6610000000000001E-2,9.8710000000000006E-2,1.1999999999999999E-3,1.4E-2,25,"=> SiFo ab 25ig"]
[1996,9.1509999999999994E-2,9.3710000000000002E-2,9.2509999999999995E-2,9.511E-2,9.6610000000000001E-2,9.8710000000000006E-2,1.1999999999999999E-3,1.4E-2,26]
[1995,9.1509999999999994E-2,9.3710000000000002E-2,9.2509999999999995E-2,9.511E-2,9.6610000000000001E-2,9.8710000000000006E-2,1.1999999999999999E-3,1.4E-2,27]
[1994,9.1509999999999994E-2,9.3710000000000002E-2,9.2509999999999995E-2,9.511E-2,9.6610000000000001E-2,9.8710000000000006E-2,1.1999999999999999E-3,1.4E-2,28]
[1993,9.1509999999999994E-2,9.3710000000000002E-2,9.2509999999999995E-2,9.511E-2,9.6610000000000001E-2,9.8710000000000006E-2,1.1999999999999999E-3,1.4E-2,29]
{"$rows_left_out":150}
{"sheet":"Parameter","index":1,"n_rows":17,"n_cols":4,"rows_kept":17,"cut":false,"hidden":true,"merged":[]}
["Parameter","Wert 1","Wert 2"]
["Sprache",{"$f":"u_sprache1","v":"it"}]
["Jahr",2022,null,"-> Regelt Gültigkeit des Rechners"]
["Jahr Beginn",{"$f":"DATE(B3,1,1)","v":"2022-01-01"}]
["Jahr Ende",{"$f":"DATE(B3,12,31)","v":"2022-12-31"}]
[{"$f":"CONCATENATE(\"Anzahl Tage im Jahr \",p_jahr)","v":"Anzahl Tage im Jahr 2022"},{"$f":"p_jahr_ende-p_jahr_beginn+1","v":365}]
["max. AHV-Jahresrente",28680,null,"-> Wichtig für alle Parameter"]
["min. koordinierter Lohn",{"$f":"B7*0.125","v":3585}]
["max. Koordinationsabzug",{"$f":"B7*0.875*Listen!F88","v":25095}]
["Eintrittsschwelle",{"$f":"B7*0.75*Listen!F88","v":21510}]
["max. vers. BVG Lohn",{"$f":"B7*30*Listen!F88","v":860400}]
["max. koordinierter Lohn",{"$f":"B7*2.125*Listen!F88","v":60945}]
["max massgebender AHV Lohn",{"$f":"B7*3*Listen!F88","v":86040}]
[{"$f":"CONCATENATE(\"Zins im Jahr \",p_jahr)","v":"Zins im Jahr 2022"},0.01,null,"Verzinsung Sparguthaben"]
["Minimales Alter",18]
{"$rows_left_out":3}
{"sheet":"Listen","index":2,"n_rows":124,"n_cols":7,"rows_kept":124,"cut":false,"hidden":true,"merged":[]}
["Sprache"]
["de",1,{"$f":"VLOOKUP(u_sprache1,Listen!A2:B4,2,FALSE)+1","v":4}]
["fr",2]
["it",3]
[]
[]
["Geschlecht"]
[{"$f":"VLOOKUP(\"geschlecht1\",texte,u_sprache,FALSE)","v":"Uomo"},1,{"$f":"VLOOKUP(u_geschlecht1,A8:B9,2,FALSE)","v":1}]
[{"$f":"VLOOKUP(\"geschlecht2\",texte,u_sprache,FALSE)","v":"Donna"},2]
[]
[{"$f":"VLOOKUP(\"geschlecht1k\",texte,u_sprache,FALSE)","v":"M"},null,{"$f":"IF(u_geschlecht=1,A11,IF(u_geschlecht=2,A12,\"\"))","v":"M"}]
[{"$f":"VLOOKUP(\"geschlecht2k\",texte,u_sprache,FALSE)","v":"F"}]
[]
[]
["Basispläne"]
{"$rows_left_out":110}
{"sheet":"Texte","index":3,"n_rows":100,"n_cols":4,"rows_kept":100,"cut":false,"hidden":true,"merged":[]}
["ID","Deutsch","Französisch","Italienisch"]
["titel1","Berechnung der Beiträge an die berufliche Vorsorge","Calcul des cotisations à la prévoyance professionnelle","Calcolo dei contributi a favore della previdenza professionale"]
["text1","Die Beitragsberechnung beruht auf den erfassten Daten. Massgebend ist schlussendlich die Beitragsrechnung der Agrisano Pencas, welche aufgrund der effektiv gemeldeten AHV-Löhne erstellt wird.","Le calcul des cotisations se base sur les données saisies. C'est finalement le calcul des cotisations d'Agrisano Pencas, établi sur la base des salaires AVS effectivement déclarés, qui est déterminant.","Il calcolo dei contributi si basa sui dati registrati. In definitiva, è decisiva la fattura dei contributi di Agrisano Pencas, che viene redatta sulla base dei salari AVS effettivamente dichiarati."]
["text1a","Sie beinhaltet zudem einen Zins für das nachschüssige Inkasso.","Celle-ci comprend notamment un intérêt pour paiement à terme échu.","Le supplemento per versamento posticipato è include."]
["text2","Bei Fragen zur Beitragsrechnung wenden Sie sich bitte an die Agrisano Stiftung Globalversicherung (Tel. 056 461 78 55).\nFür die Berechnung der Beiträge von (teil-)invaliden Arbeitnehmenden nehmen Sie bitte Kontakt mit der Agrisano Pencas auf (Tel. 056 461 78 11).","Pour toute question, veuillez prendre contact avec Fondation Agrisano, Aussurance globale  (Tél. 056 461 78 55).\nPour le calcul des cotisations d’employés invalides (partiels ou totaux), veuillez prendre contact avec Agrisano Pencas (Tél. 056 461 78 11).","In caso di domande sull’avviso di premio si prega di rivolgersi alla Fondazione Agrisano, Assicurazione globale (tel. 056 461 78 55).\nPer il calcolo del premio di impiegati (parzialmente) invalidi si prega di prendere contatto con Agrisano Pencas (tel. 056 461 78 11)."]
["text3","Die Versicherungspflicht gilt nur für Anstellungsverhältnisse, die für mehr als 3 Monate dauern (gilt auch, wenn das Arbeitsverhältnis zwischenzeitlich maximal 3 Monate unterbrochen wird, die Gesamtbeschäftigungsdauer aber mehr als 92 Tage beträgt).","L'obligation d'assurance s’applique uniquement aux rapports de travail qui ont été conclus pour plus de 3 mois (vaut également si la relation de travail est interrompue au maximum 3 mois, mais que la durée totale de l'emploi est de plus de 92 jours).","L’obbligo di assicurazione trova applicazione soltanto per i rapporti d’impiego che sono stati contratti per una durata superiore a 3 mesi (applicabile anche se il rapporto di lavoro viene interrotto temporaneamente per un periodo massimo di 3 mesi, ma la durata complessiva dell’occupazione è comunque superiore a 92 giorni)."]
["text_druck","Die Beitragsberechnung beruht auf den erfassten Daten. Massgebend ist schlussendlich die Beitragsrechnung der Agrisano Pencas, welche aufgrund der effektiv gemeldeten AHV-Löhne erstellt wird. Sie beinhaltet zudem einen Zins für das nachschüssige Inkasso.\nBei Fragen zur Beitragsrechnung wenden Sie sich bitte an die Agrisano Stiftung Globalversicherung (Tel. 056 461 78 55).\nFür die Berechnung der Beiträge von (teil-)invaliden Arbeitnehmenden nehmen Sie bitte Kontakt mit der Agrisano Pencas auf (Tel. 056 461 78 11).\nDie Versicherungspflicht gilt nur für Anstellungsverhältnisse, die für mehr als 3 Monate dauern (gilt auch, wenn das Arbeitsver-hältnis zwischenzeitlich maximal 3 Monate unterbrochen wird, die Gesamtbeschäftigungsdauer aber mehr als 92 Tage beträgt).","Le calcul des cotisations se base sur les données saisies. C'est finalement le calcul des cotisations d'Agrisano Pencas, établi sur la base des salaires AVS effectivement déclarés, qui est déterminant. Celle-ci comprend notamment un intérêt pour paiement à terme échu.\nPour toute question, veuillez prendre contact avec Fondation Agrisano, Aussurance globale  \nPour le calcul des cotisations d’employés invalides (partiels ou totaux), veuillez prendre contact avec Agrisano Pencas (Tél. 056 461 78 11).\nL'obligation d'assurance s’applique uniquement aux rapports de travail qui ont été conclus pour plus de 3 mois (vaut également si la relation de travail est interrompue au maximum 3 mois, mais que la durée totale de l'emploi est de plus de 92 jours).","Il calcolo dei contributi si basa sui dati registrati. In definitiva, è decisiva la fattura dei contributi di Agrisano Pencas, che viene redatta sulla base dei salari AVS effettivamente dichiarati. Le supplemento per versamento posticipato è include.\nIn caso di domande sull’avviso di premio si prega di rivolgersi alla Fondazione Agrisano, Assicurazione globale (tel. 056 461 78 55).\nPer il calcolo del premio di impiegati (parzialmente) invalidi si prega di prendere contatto con Agrisano Pencas (tel. 056 461 78 11).\nL’obbligo di assicurazione trova applicazione soltanto per i rapporti d’impiego che sono stati contratti per una durata superiore a 3 mesi (applicabile anche se il rapporto di lavoro viene interrotto temporaneamente per un periodo massimo di 3 mesi, ma la durata complessiva dell’occupazione è comunque superiore a 92 giorni)."]
["geschlecht1","männlich","masculin","Uomo"]
["geschlecht2","weiblich","feminin","Donna"]
["planA","Plan A","Plan A","Piano A"]
["planB","Plan B","Plan B","Piano B"]
["planC","Plan C","Plan C","Piano C"]
["planE","Zusatzplan E","Plan supplementaire E","Piano supplementare E"]
["planF","Zusatzplan F","Plan supplementaire F","Piano supplementare F"]
["planE+","Zusatzplan E+","Plan supplementaire E+","Piano supplementare E+"]
{"$rows_left_out":86}
{"sheet":"Berechnung_einzeln","index":4,"n_rows":48,"n_cols":8,"rows_kept":48,"cut":false,"hidden":true,"merged":[]}
["Berechnungen"]
[]
["Anstellungsdauer",null,null,null,"Bedingungen","Standard","mit KOA"]
["Start Anstellung",{"$f":"u_anst_start","v":44562},null,null,"Jahrgang erfasst",{"$f":"IF(u_jahrgang>0,TRUE,FALSE)","v":true}]
["Ende Anstellung",{"$f":"u_anst_ende","v":44926},null,null,"Geschlecht erfasst",{"$f":"IF(u_geschlecht1=\"\",FALSE,TRUE)","v":true}]
["Anzahl Tage",{"$f":"IF(OR(B4=0,B5=0,B5-B4+1<0),1,B5-B4+1)","v":365},null,null,"Alter min erreicht",{"$f":"IF(p_jahr-p_alter_min>=u_jahrgang,TRUE,FALSE)","v":true}]
[null,null,null,null,"Unter Alter max",{"$f":"IF(AND(u_geschlecht=1,p_jahr-p_alter_max_m<=u_jahrgang),TRUE,IF(AND(u_geschlecht=2,p_jahr-p_alter_max_w<=u_jahrgang),TRUE,FALSE))","v":true}]
["Lohn",null,"mit KOA",null,"Basisplan erfasst",{"$f":"IF(u_plan1=\"\",FALSE,TRUE)","v":true}]
["AHV-Lohn während der Anstellung",{"$f":"u_lohn","v":86040},null,null,"Koa erfasst",{"$f":"IF(u_plan_koa1=\"\",FALSE,TRUE)","v":true}]
["AHV-Lohn auf Kalenderjahr hochgerechnet",{"$f":"u_lohn/b_anst_dauer*p_jahr_tage","v":86040},null,null,"Vk-Tarif erfasst",{"$f":"IF(u_vkrabatt1=\"\",FALSE,TRUE)","v":true}]
["min. koord. Lohn (auf Dauer)",{"$f":"ROUND(p_min_kolohn/p_jahr_tage*b_anst_dauer,0)","v":3585},{"$f":"ROUND(p_min_kolohn/p_jahr_tage*b_anst_dauer,0)","v":3585},null,"Tage vorhanden",{"$f":"b_anst_dauer>1","v":true}]
["eff. Koordinationabzug (auf Dauer)",{"$f":"IF(F20,ROUND(p_max_koabzug/p_jahr_tage*b_anst_dauer,0),0)","v":25095},{"$f":"ROUND(p_max_koabzug/p_jahr_tage*b_anst_dauer,0)","v":25095},null,"Lohn vorhanden",{"$f":"B9>0","v":true},null,"=> Lohn grösser 0"]
["Max. vers. Lohn BVG (auf Dauer)",{"$f":"ROUND(p_maxBVGLohn/p_jahr_tage*b_anst_dauer,2)","v":860400},{"$f":"ROUND(p_maxBVGLohn/p_jahr_tage*b_anst_dauer,2)","v":860400},null,"Über Eintrittsschwelle",{"$f":"b_lohn_jahr>p_eintrittsschwelle","v":true}]
["Max Lohn - Koordinationsabzug",{"$f":"B13-B12","v":835305},{"$f":"C13-C12","v":835305},null,"Lohn über min. Ko.lohn",{"$f":"B9>=(B11+B12)","v":true},{"$f":"B9>=(C11+C12)","v":true},"=> wenn falsch, dann KoordLohn = min. koordLohn // eigener Wert für mit/ohne Koa"]
["Koord. Lohn (auf Dauer)",{"$f":"ROUND(IF(b_grundlagen_erf,IF(Listen!F88=0,0,IF($F$15,B14,IF($F$14,u_lohn-B12,B11))),0),0)","v":60945},{"$f":"ROUND(IF(b_grundlagen_erf,IF(IF('Beitragsrechner IV'!G3=2022,u_ivfaktor=0,u_ivfaktor2=0),0,IF(F15,C14,IF(G14,u_lohn-C12,C11))),0),0)","v":60945},null,"Übertrifft max. Vers Lohn",{"$f":"b_lohn_jahr>p_maxBVGLohn","v":false}]
{"$rows_left_out":34}
{"sheet":"Beitragsrechner","index":5,"n_rows":49,"n_cols":15,"rows_kept":49,"cut":false,"hidden":false,"merged":[[12,1,12,2],[12,3,12,4],[9,1,9,2],[9,3,9,4],[10,1,10,2],[10,3,10,4],[11,1,11,2],[11,3,11,4],[2,8,2,9],[5,1,5,12],[6,1,6,12],[7,1,7,12],[3,1,3,12],[2,11,2,12],[21,9,21,10],[20,9,20,10],[13,3,13,4],[14,1,14,2],[14,3,14,4],[15,1,15,2],[15,3,15,4],[13,1,13,2],[20,5,20,6],[20,7,20,8],[21,3,21,4],[21,5,21,6],[21,7,21,8],[24,1,24,2],[26,1,26,2],[16,1,16,2],[16,3,16,4],[20,3,20,4]]}
[]
[null,null,null,null,null,null,null,null,{"$f":"VLOOKUP(\"as_pencas\",texte,u_sprache,FALSE)","v":"Agrisano Pencas"}]
[null,null,null,null,null,null,null,null,{"$f":"VLOOKUP(\"as_pencas1\",texte,u_sprache,FALSE)","v":"Previdenza professionale"},null,null,{"$f":"TODAY()","v":"2022-07-21"}]
[null,{"$f":"VLOOKUP(\"titel1\",texte,u_sprache,FALSE)","v":"Calcolo dei contributi a favore della previdenza professionale"},null,null,null,null,null,null,null,null,null,null,null,null,"it"]
[]
[null,{"$f":"VLOOKUP(\"text1\",texte,u_sprache,FALSE)","v":"Il calcolo dei contributi si basa sui dati registrati. In definitiva, è decisiva la fattura dei contributi di Agrisano Pencas, che viene redatta sulla base dei salari AVS effettivamente dichiarati."}]
[null,{"$f":"VLOOKUP(\"text2\",texte,u_sprache,FALSE)","v":"In caso di domande sull’avviso di premio si prega di rivolgersi alla Fondazione Agrisano, Assicurazione globale (tel. 056 461 78 55).\nPer il calcolo del premio di impiegati (parzialmente) invalidi si prega di prendere contatto con Agrisano Pencas (tel. 056 461 78 11)."}]
[null,{"$f":"VLOOKUP(\"text3\",texte,u_sprache,FALSE)","v":"L’obbligo di assicurazione trova applicazione soltanto per i rapporti d’impiego che sono stati contratti per una durata superiore a 3 mesi (applicabile anche se il rapporto di lavoro viene interrotto temporaneamente per un periodo massimo di 3 mesi, ma la durata complessiva dell’occupazione è comunque superiore a 92 giorni)."}]
[]
[null,{"$f":"VLOOKUP(\"name\",texte,u_sprache,FALSE)","v":"Nome / Cognome"},null,null,null,null,{"$f":"VLOOKUP(\"jahr\",texte,u_sprache,FALSE)","v":"Anno"},null,{"$f":"p_jahr","v":2022},null,null,null,null,""]
[null,{"$f":"VLOOKUP(\"ahvnr\",texte,u_sprache,FALSE)","v":"N. AVS"},null,null,null,null,{"$f":"VLOOKUP(\"anstellungsdauer\",texte,u_sprache,FALSE)","v":"Durata dell’impiego da"},null,"2022-01-01"]
[null,{"$f":"VLOOKUP(\"jahrgang\",texte,u_sprache,FALSE)","v":"Anno di nascita"},null,1970,null,null,{"$f":"VLOOKUP(\"anstellungsdauer_bis\",texte,u_sprache,FALSE)","v":"Durata dell’impiego a"},null,"2022-12-31"]
[null,{"$f":"VLOOKUP(\"geschlecht\",texte,u_sprache,FALSE)","v":"Sesso"},null,"Uomo",null,null,{"$f":"VLOOKUP(\"tage\",texte,u_sprache,FALSE)","v":"Giorni"},null,{"$f":"Berechnung_einzeln!B6","v":365}]
[null,{"$f":"VLOOKUP(\"basisplan\",texte,u_sprache,FALSE)","v":"Piano di base"},null,"Piano A",null,null,{"$f":"VLOOKUP(\"ahvlohn\",texte,u_sprache,FALSE)","v":"Salario AVS percepito durante l’impiego"},null,86040]
[null,{"$f":"VLOOKUP(\"koa\",texte,u_sprache,FALSE)","v":"Deduzione di coordinamento"},null,"Con deduzione di coordinamento",null,null,{"$f":"VLOOKUP(\"text4\",texte,u_sprache,FALSE)","v":"Per la durata dell'impiego"}]
{"$rows_left_out":35}
{"sheet":"Beitragsrechner IV","index":6,"n_rows":54,"n_cols":14,"rows_kept":54,"cut":false,"hidden":true,"merged":[[26,7,26,8],[26,9,26,10],[27,3,27,4],[27,5,27,6],[27,7,27,8],[27,9,27,10],[20,1,20,2],[19,3,19,4],[20,3,20,4],[26,3,26,4],[26,5,26,6],[16,1,16,2],[16,3,16,4],[18,1,18,2],[17,3,17,4],[19,1,19,2],[17,1,17,2],[18,3,18,4],[13,1,13,2],[13,3,13,4],[14,1,14,2],[14,3,14,4],[15,1,15,2],[15,3,15,4],[11,1,11,12],[6,8,6,9],[6,11,6,12],[7,1,7,12],[9,1,9,12],[10,1,10,12]]}
[]
[null,{"$f":"VLOOKUP(\"ivrechner\",texte,u_sprache,FALSE)","v":"Calcolatore AI"}]
[null,{"$f":"VLOOKUP(\"ivrechner_aktiv\",texte,u_sprache,FALSE)","v":"Calcolatore AI attivo?"},null,"Nicht aktiv",null,"Eintritt AUF","alt"]
[]
[]
[null,null,null,null,null,null,null,null,{"$f":"VLOOKUP(\"as_pencas\",texte,u_sprache,FALSE)","v":"Agrisano Pencas"}]
[null,null,null,null,null,null,null,null,{"$f":"VLOOKUP(\"as_pencas1\",texte,u_sprache,FALSE)","v":"Previdenza professionale"},null,null,{"$f":"TODAY()","v":"2022-07-21"}]
[null,{"$f":"VLOOKUP(\"titel1_iv\",texte,u_sprache,FALSE)","v":"Calcolo dei contributi a favore della previdenza pro-fessionale"}]
[]
[null,{"$f":"VLOOKUP(\"text1\",texte,u_sprache,FALSE)","v":"Il calcolo dei contributi si basa sui dati registrati. In definitiva, è decisiva la fattura dei contributi di Agrisano Pencas, che viene redatta sulla base dei salari AVS effettivamente dichiarati."}]
[null,{"$f":"VLOOKUP(\"text2\",texte,u_sprache,FALSE)","v":"In caso di domande sull’avviso di premio si prega di rivolgersi alla Fondazione Agrisano, Assicurazione globale (tel. 056 461 78 55).\nPer il calcolo del premio di impiegati (parzialmente) invalidi si prega di prendere contatto con Agrisano Pencas (tel. 056 461 78 11)."}]
[null,{"$f":"VLOOKUP(\"text3\",texte,u_sprache,FALSE)","v":"L’obbligo di assicurazione trova applicazione soltanto per i rapporti d’impiego che sono stati contratti per una durata superiore a 3 mesi (applicabile anche se il rapporto di lavoro viene interrotto temporaneamente per un periodo massimo di 3 mesi, ma la durata complessiva dell’occupazione è comunque superiore a 92 giorni)."}]
[]
[null,{"$f":"VLOOKUP(\"name\",texte,u_sprache,FALSE)","v":"Nome / Cognome"},null,null,null,null,{"$f":"VLOOKUP(\"jahr\",texte,u_sprache,FALSE)","v":"Anno"},null,{"$f":"p_jahr","v":2022},null,null,null,null,""]
[null,{"$f":"VLOOKUP(\"ahvnr\",texte,u_sprache,FALSE)","v":"N. AVS"},null,null,null,null,{"$f":"VLOOKUP(\"anstellungsdauer\",texte,u_sprache,FALSE)","v":"Durata dell’impiego da"},null,"2022-01-01"]
{"$rows_left_out":40}
{"sheet":"Druck","index":7,"n_rows":68,"n_cols":15,"rows_kept":68,"cut":false,"hidden":false,"merged":[[7,2,7,13],[12,2,12,4],[12,5,12,6],[13,2,13,4],[13,5,13,6],[14,2,14,4],[14,5,14,6],[55,11,57,11],[23,5,23,6],[28,5,28,6],[23,2,23,4],[15,2,15,4],[15,5,15,6],[20,2,20,4],[20,5,20,6],[72,6,72,14],[66,1,66,15],[67,1,69,15],[16,2,16,4],[16,5,16,6],[38,10,38,11],[52,13,52,14],[46,10,46,11],[49,10,49,11],[42,13,42,14],[29,13,29,14],[32,10,32,11],[32,13,32,14],[35,10,35,11],[35,13,35,14],[55,10,57,10],[62,13,62,14],[45,5,45,6],[21,2,21,4],[49,13,49,14],[59,13,59,14],[46,13,46,14],[41,13,41,14],[52,10,52,11],[41,5,41,6],[22,2,22,4],[21,5,21,6],[38,13,38,14],[41,10,41,11],[42,10,42,11],[22,5,22,6],[29,10,29,11]]}
[]
[]
[]
[]
[]
[]
[]
[null,null,{"$f":"CONCATENATE(VLOOKUP(\"titel1\",texte,u_sprache,FALSE),\" \",p_jahr)","v":"Calcolo dei contributi a favore della previdenza professionale 2022"},null,null,null,null,null,null,null,null,null,null,null,{"$f":"TODAY()","v":"2022-07-21"}]
[]
[]
[null,null,{"$f":"VLOOKUP(\"person\",texte,u_sprache,FALSE)","v":"Persona assicurata "},null,null,null,null,null,null,null,{"$f":"VLOOKUP(\"anstellung\",texte,u_sprache,FALSE)","v":"L'impiego"}]
[]
[null,null,{"$f":"VLOOKUP(\"name\",texte,u_sprache,FALSE)","v":"Nome / Cognome"},null,null,{"$f":"IF(u_name=0,\"\",u_name)","v":""},null,null,null,null,{"$f":"VLOOKUP(\"jahr\",texte,u_sprache,FALSE)","v":"Anno"},null,null,null,{"$f":"p_jahr","v":2022}]
[null,null,{"$f":"VLOOKUP(\"ahvnr\",texte,u_sprache,FALSE)","v":"N. AVS"},null,null,{"$f":"IF(u_ahvnr=0,\"\",u_ahvnr)","v":""},null,null,null,null,{"$f":"VLOOKUP(\"anstellungsdauer\",texte,u_sprache,FALSE)","v":"Durata dell’impiego da"},null,null,null,{"$f":"u_anst_start","v":"2022-01-01"}]
[null,null,{"$f":"VLOOKUP(\"jahrgang\",texte,u_sprache,FALSE)","v":"Anno di nascita"},null,null,{"$f":"u_jahrgang","v":1970},null,null,null,null,{"$f":"VLOOKUP(\"anstellungsdauer_bis\",texte,u_sprache,FALSE)","v":"Durata dell’impiego a"},null,null,null,{"$f":"u_anst_ende","v":"2022-12-31"}]
{"$rows_left_out":54}
{"sheet":"Erfassung_Bestand","index":8,"n_rows":1013,"n_cols":7,"rows_kept":1013,"cut":false,"hidden":true,"merged":[[2,5,2,6],[3,5,3,6],[0,0,0,6]]}
[{"$f":"VLOOKUP(\"titel_bestandesrechner\",texte,u_sprache,FALSE)","v":"Calcolo dei contributi del portafoglio"}]
[]
[{"$f":"VLOOKUP(\"basisplan\",texte,u_sprache,FALSE)","v":"Piano di base"},"Plan A",null,null,{"$f":"VLOOKUP(\"name_betrieb\",texte,u_sprache,FALSE)","v":"Nome"}]
[{"$f":"VLOOKUP(\"koa\",texte,u_sprache,FALSE)","v":"Deduzione di coordinamento"},"mit Koordinationsabzug",null,null,{"$f":"VLOOKUP(\"adresse\",texte,u_sprache,FALSE)","v":"Indirizzo"}]
[{"$f":"VLOOKUP(\"zusatzplan\",texte,u_sprache,FALSE)","v":"Piano supplementare"},"Kein Zusatzplan"]
[{"$f":"VLOOKUP(\"vktarif\",texte,u_sprache,FALSE)","v":"Tariffa die costi di gestione"},"Standardtarif"]
[{"$f":"VLOOKUP(\"beitrag_an\",texte,u_sprache,FALSE)","v":"Contributo del lavoratore"},0.5]
[]
[{"$f":"VLOOKUP(\"hinweis_erf_bestand\",texte,u_sprache,FALSE)","v":"Nota: per il calcolo degli invalidi, utilizzare il calcolatore individuale."}]
[]
[{"$f":"VLOOKUP(\"name\",texte,u_sprache,FALSE)","v":"Nome / Cognome"},{"$f":"VLOOKUP(\"geschlecht\",texte,u_sprache,FALSE)","v":"Sesso"},{"$f":"VLOOKUP(\"jahrgang\",texte,u_sprache,FALSE)","v":"Anno di nascita"},{"$f":"VLOOKUP(\"anstellungsdauer_k\",texte,u_sprache,FALSE)","v":"Impiegato da"},{"$f":"VLOOKUP(\"anstellungsdauer_bis_k\",texte,u_sprache,FALSE)","v":"Impiegato a"},{"$f":"VLOOKUP(\"ahvlohn_k\",texte,u_sprache,FALSE)","v":"Salario AVS"},{"$f":"VLOOKUP(\"zusatzplan\",texte,u_sprache,FALSE)","v":"Piano supplementare"}]
[null,null,null,null,null,null,{"$f":"be_zusatzplan","v":"Kein Zusatzplan"}]
[null,null,null,null,null,null,"Kein Zusatzplan"]
[null,null,null,null,null,null,"Kein Zusatzplan"]
[null,null,null,null,null,null,"Kein Zusatzplan"]
{"$rows_left_out":999}
{"sheet":"Bestandesübersicht","index":9,"n_rows":18,"n_cols":13,"rows_kept":18,"cut":false,"hidden":true,"merged":[[1,6,1,8]]}
[null,null,null,null,null,null,"Agrisano Pencas"]
[null,null,null,null,null,null,"Berufliche Vorsorge"]
["Beitragsverzeichnis Pensionskasse 2022",null,null,null,null,null,null,null,null,null,null,null,{"$f":"TODAY()","v":"2022-07-21"}]
[]
[]
[]
[]
["Plan A, mit Koordinationsabzug, Standardtarif",null,null,null,null,null,null,null,null,null,null,"Beitrag Arbeitnehmer",0.5]
["Vorname / Name  ",null,"Jahrgang","AHV-Lohn","Versicherter Lohn","Sparbeitrag %","Sparbeitrag","Risikobeitrag %","Risikobeitrag","Verwaltungs-kosten","Sicherheits-fonds Beitrag","Total Beitrag","davon Anteil Arbeitnehmer"]
[null,null,null,null,null,null,null,null,"Grundbeitrag Verwaltungskosten",null,null,95]
[null,null,null,null,null,null,null,null,"Verwaltungskosten Zusatzplan",null,null,{"$f":"IF(u_zusatzplan=0,0,95)","v":0}]
[null,null,null,null,null,null,null,null,"Total Beiträge Betrieb",null,null,{"$f":"SUM(L10:L11)","v":95}]
[]
[null,null,null,null,null,null,null,null,"Beitrag Arbeitnehmer",null,null,{"$f":"SUM(M9:M10)","v":0}]
[null,null,null,null,null,null,null,null,"Beitrag Arbeitgeber",null,null,{"$f":"L12-L14","v":95}]
{"$rows_left_out":3}